Target
Renin
Ligand
BDBM50311799
Substrate
Meas. Tech.
ChEMBL_619906 (CHEMBL1110296)
IC50
0.55±n/a nM
Citation
 Remen, LBezençon, ORichard-Bildstein, SBur, DPrade, LCorminboeuf, OBoss, CGrisostomi, CSifferlen, TStrickner, PHess, PDelahaye, STreiber, AWeller, TBinkert, CSteiner, BFischli, W New classes of potent and bioavailable human renin inhibitors. Bioorg Med Chem Lett 19:6762-5 (2009)  
Target
Name:
Renin
Synonyms:
Angiotensinogenase RENI_HUMAN
Type:
Enzyme
Mol. Mass.:
45058.99
Organism:
Homo sapiens (Human)
Description:
Residue:
406
  
Inhibitor
Name:
BDBM50311799
Synonyms:
(1R,5R)-3-(4-(3-(2-chloro-3,6-difluorophenoxy)propyl)phenyl)-N-cyclopropyl-N-(2,3-dichlorobenzyl)-8-azabicyclo[3.2.1]oct-2-ene-2-carboxamide | CHEMBL1076449
Type:
Small organic molecule
Emp. Form.:
C33H31Cl3F2N2O2
Mol. Mass.:
631.967
SMILES:
Fc1ccc(F)c(OCCCc2ccc(cc2)C2=C([C@H]3CC[C@H](C2)N3)C(=O)N(Cc2cccc(Cl)c2Cl)C2CC2)c1Cl
: