Target
Low molecular weight protein-tyrosine phosphatase A
Ligand
BDBM50312246
Substrate
Meas. Tech.
ChEMBL_621991 (CHEMBL1106782)
Ki
68000±n/a nM
Citation
 Rawls, KALang, PTTakeuchi, JImamura, SBaguley, TDGrundner, CAlber, TEllman, JA Fragment-based discovery of selective inhibitors of the Mycobacterium tuberculosis protein tyrosine phosphatase PtpA. Bioorg Med Chem Lett 19:6851-4 (2009)  
Target
Name:
Low molecular weight protein-tyrosine phosphatase A
Synonyms:
PTPA_MYCTU Probable low molecular weight protein-tyrosine-phosphatase mptpA | ptpA
Type:
Hydrolase
Mol. Mass.:
17891.84
Organism:
Mycobacterium tuberculosis
Description:
Residue:
163
  
Inhibitor
Name:
BDBM50312246
Synonyms:
(4-(2-chlorophenylcarbamoyl)phenyl)difluoromethylphosphonic acid | CHEMBL1082130
Type:
Small organic molecule
Emp. Form.:
C14H11ClF2NO4P
Mol. Mass.:
361.665
SMILES:
OP(O)(=O)C(F)(F)c1ccc(cc1)C(=O)Nc1ccccc1Cl
: