Target
Sodium-dependent serotonin transporter
Ligand
BDBM50312778
Substrate
Meas. Tech.
ChEMBL_615839 (CHEMBL1101949)
Ki
>10000±n/a nM
Citation
 Yu, MLizarzaburu, MBeckmann, HConnors, RDai, KHaller, KLi, CLiang, LLindstrom, MMa, JMotani, AWanska, MZhang, ALi, LMedina, JC Identification of piperazine-bisamide GHSR antagonists for the treatment of obesity. Bioorg Med Chem Lett 20:1758-62 (2010)  
Target
Name:
Sodium-dependent serotonin transporter
Synonyms:
5-HT Transporter 5HTT SC6A4_HUMAN SLC6A4 Serotonin transporter (5HTT) Sodium-dependent serotonin transporter (SERT) | Solute carrier family 6 member 4
Type:
Multi-pass membrane protein
Mol. Mass.:
70322.51
Organism:
Homo sapiens (Human)
Description:
P31645
Residue:
630
  
Inhibitor
Name:
BDBM50312778
Synonyms:
(S)-(4-(1H-indole-6-carbonyl)-3-methylpiperazin-1-yl)(2'-fluorobiphenyl-4-yl)methanone | CHEMBL1080389
Type:
Small organic molecule
Emp. Form.:
C27H24FN3O2
Mol. Mass.:
441.4968
SMILES:
C[C@H]1CN(CCN1C(=O)c1ccc2cc[nH]c2c1)C(=O)c1ccc(cc1)-c1ccccc1F
: