Target
Cathepsin D
Ligand
BDBM50313796
Substrate
Meas. Tech.
ChEMBL_615206 (CHEMBL1107841)
IC50
35±n/a nM
Citation
 Hanessian, SShao, ZBetschart, CRondeau, JMNeumann, UTintelnot-Blomley, M Structure-based design and synthesis of novel P2/P3 modified, non-peptidic beta-secretase (BACE-1) inhibitors. Bioorg Med Chem Lett 20:1924-7 (2010)  
Target
Name:
Cathepsin D
Synonyms:
CATD_HUMAN CTSD Cathepsin D heavy chain Cathepsin D precursor
Type:
Enzyme
Mol. Mass.:
44551.72
Organism:
Homo sapiens (Human)
Description:
Human proCathepsin D (SwissProt accession number P07339) was expressed in Sf9 cells, purified, and autoactivated.
Residue:
412
  
Inhibitor
Name:
BDBM50313796
Synonyms:
(2R,4S,5S)-5-((S)-2-((S)-2-acetamidopropanamido)-4-(methylthio)butanamido)-N-butyl-4-hydroxy-2,7-dimethyloctanamide | CHEMBL1088215
Type:
Small organic molecule
Emp. Form.:
C24H46N4O5S
Mol. Mass.:
502.711
SMILES:
CCCCNC(=O)[C@H](C)C[C@H](O)[C@H](CC(C)C)NC(=O)[C@H](CCSC)NC(=O)[C@H](C)NC(C)=O
: