Target
Baculoviral IAP repeat-containing protein 7
Ligand
BDBM50314476
Substrate
Meas. Tech.
ChEMBL_624591 (CHEMBL1111551)
Ki
36000±n/a nM
Citation
 Cohen, FKoehler, MFBergeron, PElliott, LOFlygare, JAFranklin, MCGazzard, LKeteltas, SFLau, KLy, CQTsui, VFairbrother, WJ Antagonists of inhibitor of apoptosis proteins based on thiazole amide isosteres. Bioorg Med Chem Lett 20:2229-33 (2010)  
Target
Name:
Baculoviral IAP repeat-containing protein 7
Synonyms:
BIR3 BIRC7_HUMAN KIAP MLIAP | RNF50
Type:
PROTEIN
Mol. Mass.:
32792.04
Organism:
Homo sapiens (Human)
Description:
ChEMBL_624591
Residue:
298
  
Inhibitor
Name:
BDBM50314476
Synonyms:
(S)-N-((S)-1-cyclohexyl-2-oxo-2-((S)-2-(7-phenylthiazolo[5,4-b]pyridin-2-yl)pyrrolidin-1-yl)ethyl)-2-(methylamino)propanamide | CHEMBL1092760
Type:
Small organic molecule
Emp. Form.:
C28H35N5O2S
Mol. Mass.:
505.675
SMILES:
CN[C@@H](C)C(=O)N[C@@H](C1CCCCC1)C(=O)N1CCC[C@H]1c1nc2c(ccnc2s1)-c1ccccc1
: