Target
Mitogen-activated protein kinase 14
Ligand
BDBM50314789
Substrate
Meas. Tech.
ChEMBL_627012 (CHEMBL1103668)
Kd
0.05±n/a nM
Citation
 Pettus, LHWurz, RPXu, SHerberich, BHenkle, BLiu, QMcBride, HJMu, SPlant, MHSaris, CJSherman, LWong, LMChmait, SLee, MRMohr, CHsieh, FTasker, AS Discovery and evaluation of 7-alkyl-1,5-bis-aryl-pyrazolopyridinones as highly potent, selective, and orally efficacious inhibitors of p38alpha mitogen-activated protein kinase. J Med Chem 53:2973-85 (2010)  
Target
Name:
Mitogen-activated protein kinase 14
Synonyms:
CSAID-binding protein CSBP1 CSPB1 MAP kinase 14 MAP kinase p38 alpha MAPK14 MK14_HUMAN Mitogen-activated protein kinase p38 alpha Stress-activated protein kinase 2a | p38 MAP kinase alpha/beta
Type:
Serine/threonine-protein kinase
Mol. Mass.:
41286.76
Organism:
Homo sapiens (Human)
Description:
Q16539
Residue:
360
  
Inhibitor
Name:
BDBM50314789
Synonyms:
CHEMBL1088796 | N-cyclopropyl-3-(1-(2-fluorophenyl)phthalazin-6-yl)-4-methylbenzamide
Type:
Small organic molecule
Emp. Form.:
C25H20FN3O
Mol. Mass.:
397.4442
SMILES:
Cc1ccc(cc1-c1ccc2c(nncc2c1)-c1ccccc1F)C(=O)NC1CC1
: