Target
Glucose-dependent insulinotropic receptor
Ligand
BDBM50315149
Substrate
Meas. Tech.
ChEMBL_624942 (CHEMBL1107065)
EC50
2000±n/a nM
Citation
 Wu, YKuntz, JDCarpenter, AJFang, JSauls, HRGomez, DJAmmala, CXu, YHart, STadepalli, S 2,5-Disubstituted pyridines as potent GPR119 agonists. Bioorg Med Chem Lett 20:2577-81 (2010)  
Target
Name:
Glucose-dependent insulinotropic receptor
Synonyms:
G-protein coupled receptor 119 (GPR119) GPR119 | Glucose-dependent insulinotropic receptor
Type:
Protein
Mol. Mass.:
36901.49
Organism:
Homo sapiens (Human)
Description:
Q8TDV5
Residue:
335
  
Inhibitor
Name:
BDBM50315149
Synonyms:
CHEMBL1091202 | isopropyl 4-((6-(4-(pyridin-3-ylsulfonyl)piperazin-1-yl)pyridin-3-yloxy)methyl)piperidine-1-carboxylate
Type:
Small organic molecule
Emp. Form.:
C24H33N5O5S
Mol. Mass.:
503.614
SMILES:
CC(C)OC(=O)N1CCC(COc2ccc(nc2)N2CCN(CC2)S(=O)(=O)c2cccnc2)CC1
: