Target
Glucose-dependent insulinotropic receptor
Ligand
BDBM50315151
Substrate
Meas. Tech.
ChEMBL_624942 (CHEMBL1107065)
EC50
1200±n/a nM
Citation
 Wu, YKuntz, JDCarpenter, AJFang, JSauls, HRGomez, DJAmmala, CXu, YHart, STadepalli, S 2,5-Disubstituted pyridines as potent GPR119 agonists. Bioorg Med Chem Lett 20:2577-81 (2010)  
Target
Name:
Glucose-dependent insulinotropic receptor
Synonyms:
G-protein coupled receptor 119 (GPR119) GPR119 | Glucose-dependent insulinotropic receptor
Type:
Protein
Mol. Mass.:
36901.49
Organism:
Homo sapiens (Human)
Description:
Q8TDV5
Residue:
335
  
Inhibitor
Name:
BDBM50315151
Synonyms:
CHEMBL1090558 | isopropyl 4-((6-(4-(N,N-diethylsulfamoyl)piperazin-1-yl)pyridin-3-yloxy)methyl)piperidine-1-carboxylate
Type:
Small organic molecule
Emp. Form.:
C23H39N5O5S
Mol. Mass.:
497.651
SMILES:
CCN(CC)S(=O)(=O)N1CCN(CC1)c1ccc(OCC2CCN(CC2)C(=O)OC(C)C)cn1
: