Target
Adenosine receptor A2a
Ligand
BDBM50315642
Substrate
Meas. Tech.
ChEMBL_623792 (CHEMBL1117075)
Ki
>100000±n/a nM
Citation
 Cheong, SLDolzhenko, AKachler, SPaoletta, SFederico, SCacciari, BDolzhenko, AKlotz, KNMoro, SSpalluto, GPastorin, G The significance of 2-furyl ring substitution with a 2-(para-substituted) aryl group in a new series of pyrazolo-triazolo-pyrimidines as potent and highly selective hA(3) adenosine receptors antagonists: new insights into structure-affinity relationship and receptor-antagonist recognition. J Med Chem 53:3361-75 (2010)  
Target
Name:
Adenosine receptor A2a
Synonyms:
A2A adenosine receptor (hA2A) ADENOSINE A2 ADORA2 Adenosine A2A receptor (A2AAR)
Type:
G Protein-Coupled Receptor (GPCR)
Mol. Mass.:
44716.46
Organism:
Homo sapiens (Human)
Description:
P29274
Residue:
412
  
Inhibitor
Name:
BDBM50315642
Synonyms:
CHEMBL1091267 | N-[2-(4-Bromophenyl)-8-phenylethyl-pyrazolo[4,3-e][1,2,4]-triazolo[1,5-c]pyrimidin-5-yl]benzamide
Type:
Small organic molecule
Emp. Form.:
C27H20BrN7O
Mol. Mass.:
538.398
SMILES:
Brc1ccc(cc1)-c1nc2c3cn(CCc4ccccc4)nc3nc(NC(=O)c3ccccc3)n2n1
: