Target
Serine/threonine-protein kinase mTOR
Ligand
BDBM50315909
Substrate
Meas. Tech.
ChEMBL_625039 (CHEMBL1109707)
Ki
50±n/a nM
Citation
 Heffron, TPBerry, MCastanedo, GChang, CChuckowree, IDotson, JFolkes, AGunzner, JLesnick, JDLewis, CMathieu, SNonomiya, JOlivero, APang, JPeterson, DSalphati, LSampath, DSideris, SSutherlin, DPTsui, VWan, NCWang, SWong, SZhu, BY Identification of GNE-477, a potent and efficacious dual PI3K/mTOR inhibitor. Bioorg Med Chem Lett 20:2408-11 (2010)  
Target
Name:
Serine/threonine-protein kinase mTOR
Synonyms:
FK506-binding protein 12-rapamycin complex-associated protein 1 FRAP FRAP1 MTOR Mammalian Target of Rapamycin (mTOR) RAFT1 Rapamycin and FKBP12 target 1 Serine/threonine-protein kinase (mTOR) | mTORC2
Type:
Rapamycin target protein
Mol. Mass.:
288917.12
Organism:
Homo sapiens (Human)
Description:
P42345
Residue:
2549
  
Inhibitor
Name:
BDBM50315909
Synonyms:
CHEMBL1090599 | N-((2-(2-aminopyrimidin-5-yl)-4-morpholinothieno[3,2-d]pyrimidin-6-yl)methyl)-N-methylacetamide
Type:
Small organic molecule
Emp. Form.:
C18H21N7O2S
Mol. Mass.:
399.47
SMILES:
CN(Cc1cc2nc(nc(N3CCOCC3)c2s1)-c1cnc(N)nc1)C(C)=O
: