Target
Aminopeptidase N
Ligand
BDBM50316381
Substrate
Meas. Tech.
ChEMBL_628651 (CHEMBL1106417)
IC50
64300±n/a nM
Citation
 Li, QFang, HWang, XXu, W Novel cyclic-imide peptidomimetics as aminopeptidase N inhibitors. Structure-based design, chemistry and activity evaluation. II. Eur J Med Chem 45:1618-26 (2010)  
Target
Name:
Aminopeptidase N
Synonyms:
AMPN_HUMAN APN Aminopeptidase CD_antigen=CD13 Myeloid plasma membrane glycoprotein CD13 gp150 | hAPN
Type:
PROTEIN
Mol. Mass.:
109522.63
Organism:
Homo sapiens (Human)
Description:
ChEMBL_1507526
Residue:
967
  
Inhibitor
Name:
BDBM50316381
Synonyms:
CHEMBL1095917 | Ethyl-2-((S)-3-((S)-2-aminopropanamido)-2,6-dioxopiperidin-1-yl)acetate hydrochloride
Type:
Small organic molecule
Emp. Form.:
C12H19N3O5
Mol. Mass.:
285.2964
SMILES:
CCOC(=O)CN1C(=O)CC[C@H](NC(=O)[C@H](C)N)C1=O
: