Target
Aminopeptidase N
Ligand
BDBM50316393
Substrate
Meas. Tech.
ChEMBL_628651 (CHEMBL1106417)
IC50
21500±n/a nM
Citation
 Li, QFang, HWang, XXu, W Novel cyclic-imide peptidomimetics as aminopeptidase N inhibitors. Structure-based design, chemistry and activity evaluation. II. Eur J Med Chem 45:1618-26 (2010)  
Target
Name:
Aminopeptidase N
Synonyms:
AMPN_HUMAN APN Aminopeptidase CD_antigen=CD13 Myeloid plasma membrane glycoprotein CD13 gp150 | hAPN
Type:
PROTEIN
Mol. Mass.:
109522.63
Organism:
Homo sapiens (Human)
Description:
ChEMBL_1507526
Residue:
967
  
Inhibitor
Name:
BDBM50316393
Synonyms:
2-((S)-3-((S)-2-Aminopropanamido)-2,6-dioxopiperidin-1-yl)acetic acid hydrochloride | CHEMBL1097595
Type:
Small organic molecule
Emp. Form.:
C10H15N3O5
Mol. Mass.:
257.2432
SMILES:
C[C@H](N)C(=O)N[C@H]1CCC(=O)N(CC(O)=O)C1=O
: