Target
Aminopeptidase N
Ligand
BDBM50316396
Substrate
Meas. Tech.
ChEMBL_628651 (CHEMBL1106417)
IC50
16600±n/a nM
Citation
 Li, QFang, HWang, XXu, W Novel cyclic-imide peptidomimetics as aminopeptidase N inhibitors. Structure-based design, chemistry and activity evaluation. II. Eur J Med Chem 45:1618-26 (2010)  
Target
Name:
Aminopeptidase N
Synonyms:
AMPN_HUMAN APN Aminopeptidase CD_antigen=CD13 Myeloid plasma membrane glycoprotein CD13 gp150 | hAPN
Type:
PROTEIN
Mol. Mass.:
109522.63
Organism:
Homo sapiens (Human)
Description:
ChEMBL_1507526
Residue:
967
  
Inhibitor
Name:
BDBM50316396
Synonyms:
2-((S)-3-((2S,3R)-2-Amino-3-methylpentanamido)-2,6-dioxopiperidin-1-yl)acetic acid hydrochloride | CHEMBL1098907
Type:
Small organic molecule
Emp. Form.:
C13H21N3O5
Mol. Mass.:
299.3229
SMILES:
CC[C@@H](C)[C@H](N)C(=O)N[C@H]1CCC(=O)N(CC(O)=O)C1=O
: