Target
Aminopeptidase N
Ligand
BDBM50316406
Substrate
Meas. Tech.
ChEMBL_628651 (CHEMBL1106417)
IC50
1800±n/a nM
Citation
 Li, QFang, HWang, XXu, W Novel cyclic-imide peptidomimetics as aminopeptidase N inhibitors. Structure-based design, chemistry and activity evaluation. II. Eur J Med Chem 45:1618-26 (2010)  
Target
Name:
Aminopeptidase N
Synonyms:
AMPN_HUMAN APN Aminopeptidase CD_antigen=CD13 Myeloid plasma membrane glycoprotein CD13 gp150 | hAPN
Type:
PROTEIN
Mol. Mass.:
109522.63
Organism:
Homo sapiens (Human)
Description:
ChEMBL_1507526
Residue:
967
  
Inhibitor
Name:
BDBM50316406
Synonyms:
(S)-2-Amino-N-((S)-1-(2-(hydroxyamino)-2-oxoethyl)-2,6-dioxopiperidin-3-yl)-3-phenylpropanamide hydrochloride | CHEMBL1099248
Type:
Small organic molecule
Emp. Form.:
C16H20N4O5
Mol. Mass.:
348.3538
SMILES:
N[C@@H](Cc1ccccc1)C(=O)N[C@H]1CCC(=O)N(CC(=O)NO)C1=O
: