Target
Aminopeptidase N
Ligand
BDBM50210531
Substrate
Meas. Tech.
ChEMBL_628651 (CHEMBL1106417)
IC50
3100±n/a nM
Citation
 Li, QFang, HWang, XXu, W Novel cyclic-imide peptidomimetics as aminopeptidase N inhibitors. Structure-based design, chemistry and activity evaluation. II. Eur J Med Chem 45:1618-26 (2010)  
Target
Name:
Aminopeptidase N
Synonyms:
AMPN_HUMAN APN Aminopeptidase CD_antigen=CD13 Myeloid plasma membrane glycoprotein CD13 gp150 | hAPN
Type:
PROTEIN
Mol. Mass.:
109522.63
Organism:
Homo sapiens (Human)
Description:
ChEMBL_1507526
Residue:
967
  
Inhibitor
Name:
BDBM50210531
Synonyms:
(S)-N-(1-(2-(Hydroxyamino)-2-oxoethyl)-2,6-dioxpiperidin-3-yl)-3,4,5-trimethoxybenzamide CHEMBL246122
Type:
Small organic molecule
Emp. Form.:
C17H21N3O8
Mol. Mass.:
395.3639
SMILES:
COc1cc(cc(OC)c1OC)C(=O)N[C@H]1CCC(=O)N(CC(=O)NO)C1=O
: