Target
Phospholipase A2, major isoenzyme
Ligand
BDBM23762
Substrate
Meas. Tech.
ChEMBL_630281 (CHEMBL1108229)
IC50
>100000±n/a nM
Citation
 Meddad-Belhabich, NAoun, DDjimdé, ARedeuilh, CDive, GMassicot, FChau, FHeymans, FLamouri, A Design of new potent and selective secretory phospholipase A(2) inhibitors. 6-Synthesis, structure-activity relationships and molecular modelling of 1-substituted-4-[4,5-dihydro-1,2,4-(4H)-oxadiazol-5-one-3-yl(methyl)]-functionalized aryl piperazin/one/dione derivatives. Bioorg Med Chem 18:3588-600 (2010)  
Target
Name:
Phospholipase A2, major isoenzyme
Synonyms:
Group IB phospholipase A2 PLA2G1B Phospholipase A2
Type:
Hydrolase; monomer or homodimer
Mol. Mass.:
16279.83
Organism:
Sus scrofa (pig)
Description:
Purchased from Sigma.
Residue:
146
  
Inhibitor
Name:
BDBM23762
Synonyms:
3-({4-[(4-octadecylpiperazin-1-yl)carbonyl]phenyl}methyl)-4,5-dihydro-1,2,4-oxadiazol-5-one | PMS 1062 piperazine deriv., 26c
Type:
Small organic molecule
Emp. Form.:
C32H52N4O3
Mol. Mass.:
540.7803
SMILES:
CCCCCCCCCCCCCCCCCCN1CCN(CC1)C(=O)c1ccc(Cc2nc(=O)o[nH]2)cc1
: