Target
Epidermal growth factor receptor
Ligand
BDBM50316792
Substrate
Meas. Tech.
ChEMBL_632804 (CHEMBL1105615)
IC50
1110±n/a nM
Citation
 Büttner, ACottin, TXu, JTzagkaroulaki, LGiannis, A Serotonin derivatives as a new class of non-ATP-competitive receptor tyrosine kinase inhibitors. Bioorg Med Chem 18:3387-402 (2010)  
Target
Name:
Epidermal growth factor receptor
Synonyms:
EGF Receptor Substrate EGFR_HUMAN ERBB1 Epidermal Growth Factor Receptor erbB-1 Epidermal growth factor receptor (EGFR) HER1 Proto-oncogene c-ErbB-1 Tyrosine-Protein Kinase ErbB-1
Type:
Receptor Kinase Domain
Mol. Mass.:
134279.59
Organism:
Homo sapiens (Human)
Description:
P00533
Residue:
1210
  
Inhibitor
Name:
BDBM50316792
Synonyms:
2-{5-(4-Hydroxyphenethoxy)-1-[4-(3-trifluoromethylphenyl)]benzyl-1H-indole-3-yl}ethanamine hydrochloride | CHEMBL1094195
Type:
Small organic molecule
Emp. Form.:
C32H29F3N2O2
Mol. Mass.:
530.5801
SMILES:
NCCc1cn(Cc2ccc(cc2)-c2cccc(c2)C(F)(F)F)c2ccc(OCCc3ccc(O)cc3)cc12
: