Target
Vascular endothelial growth factor receptor 3
Ligand
BDBM50316775
Substrate
Meas. Tech.
ChEMBL_632807 (CHEMBL1105618)
IC50
960±n/a nM
Citation
 Büttner, ACottin, TXu, JTzagkaroulaki, LGiannis, A Serotonin derivatives as a new class of non-ATP-competitive receptor tyrosine kinase inhibitors. Bioorg Med Chem 18:3387-402 (2010)  
Target
Name:
Vascular endothelial growth factor receptor 3
Synonyms:
FLT-4 Fms-like tyrosine kinase 4 VEGFR-3 VGFR3_HUMAN Vascular endothelial growth factor receptor 3 (VEGFR-3) | Vascular endothelial growth factor receptor 3 (VEGFR3)
Type:
Protein
Mol. Mass.:
152749.58
Organism:
Homo sapiens (Human)
Description:
P35916-2
Residue:
1363
  
Inhibitor
Name:
BDBM50316775
Synonyms:
2-[5-(4-Hydroxyphenethoxy)-1-(4-methoxyphenyl)-benzyl-1H-indole-3-yl]ethanamine hydrochloride | CHEMBL1094196
Type:
Small organic molecule
Emp. Form.:
C32H32N2O3
Mol. Mass.:
492.6081
SMILES:
COc1ccc(cc1)-c1ccc(Cn2cc(CCN)c3cc(OCCc4ccc(O)cc4)ccc23)cc1
: