Target
Epidermal growth factor receptor
Ligand
BDBM50316779
Substrate
Meas. Tech.
ChEMBL_632804 (CHEMBL1105615)
IC50
2450±n/a nM
Citation
 Büttner, ACottin, TXu, JTzagkaroulaki, LGiannis, A Serotonin derivatives as a new class of non-ATP-competitive receptor tyrosine kinase inhibitors. Bioorg Med Chem 18:3387-402 (2010)  
Target
Name:
Epidermal growth factor receptor
Synonyms:
EGF Receptor Substrate EGFR_HUMAN ERBB1 Epidermal Growth Factor Receptor erbB-1 Epidermal growth factor receptor (EGFR) HER1 Proto-oncogene c-ErbB-1 Tyrosine-Protein Kinase ErbB-1
Type:
Receptor Kinase Domain
Mol. Mass.:
134279.59
Organism:
Homo sapiens (Human)
Description:
P00533
Residue:
1210
  
Inhibitor
Name:
BDBM50316779
Synonyms:
2-{5-(4-Methoxyphenethoxy)-1-{5-[4-(methylthio)-phenyl]pentyl}-1H-indole-3-yl}ethanamine hydrochloride | CHEMBL1094835
Type:
Small organic molecule
Emp. Form.:
C31H38N2O2S
Mol. Mass.:
502.711
SMILES:
COc1ccc(CCOc2ccc3n(CCCCCc4ccc(SC)cc4)cc(CCN)c3c2)cc1
: