Target
Epidermal growth factor receptor
Ligand
BDBM50316780
Substrate
Meas. Tech.
ChEMBL_632804 (CHEMBL1105615)
IC50
1660±n/a nM
Citation
 Büttner, ACottin, TXu, JTzagkaroulaki, LGiannis, A Serotonin derivatives as a new class of non-ATP-competitive receptor tyrosine kinase inhibitors. Bioorg Med Chem 18:3387-402 (2010)  
Target
Name:
Epidermal growth factor receptor
Synonyms:
EGF Receptor Substrate EGFR_HUMAN ERBB1 Epidermal Growth Factor Receptor erbB-1 Epidermal growth factor receptor (EGFR) HER1 Proto-oncogene c-ErbB-1 Tyrosine-Protein Kinase ErbB-1
Type:
Receptor Kinase Domain
Mol. Mass.:
134279.59
Organism:
Homo sapiens (Human)
Description:
P00533
Residue:
1210
  
Inhibitor
Name:
BDBM50316780
Synonyms:
4-(2-(3-Amino-9-(5-(4-(dimethylamino)phenyl)pentyl)-2,3,4,9-tetrahydro-1H-tetrahydrocarbazole-6-yloxy)ethyl)-phenol dihydrochloride | CHEMBL3216254
Type:
Small organic molecule
Emp. Form.:
C33H43Cl2N3O2
Mol. Mass.:
584.619
SMILES:
Cl.Cl.CN(C)c1ccc(CCCCCn2c3CCC(N)Cc3c3cc(OCCc4ccc(O)cc4)ccc23)cc1
: