Target
Insulin-like growth factor 1 receptor
Ligand
BDBM50316779
Substrate
Meas. Tech.
ChEMBL_632812 (CHEMBL1111026)
IC50
980±n/a nM
Citation
 Büttner, ACottin, TXu, JTzagkaroulaki, LGiannis, A Serotonin derivatives as a new class of non-ATP-competitive receptor tyrosine kinase inhibitors. Bioorg Med Chem 18:3387-402 (2010)  
Target
Name:
Insulin-like growth factor 1 receptor
Synonyms:
CD_antigen=CD221 IGF1R Insulin-like growth factor 1 receptor (IGF1R) Insulin-like growth factor 1 receptor alpha chain Insulin-like growth factor I receptor | Insulin-like growth factor receptor (IGFR)
Type:
Protein
Mol. Mass.:
154776.79
Organism:
Homo sapiens (Human)
Description:
P08069
Residue:
1367
  
Inhibitor
Name:
BDBM50316779
Synonyms:
2-{5-(4-Methoxyphenethoxy)-1-{5-[4-(methylthio)-phenyl]pentyl}-1H-indole-3-yl}ethanamine hydrochloride | CHEMBL1094835
Type:
Small organic molecule
Emp. Form.:
C31H38N2O2S
Mol. Mass.:
502.711
SMILES:
COc1ccc(CCOc2ccc3n(CCCCCc4ccc(SC)cc4)cc(CCN)c3c2)cc1
: