Target
Vascular endothelial growth factor receptor 2
Ligand
BDBM50316784
Substrate
Meas. Tech.
ChEMBL_632814 (CHEMBL1111028)
IC50
2070±n/a nM
Citation
 Büttner, ACottin, TXu, JTzagkaroulaki, LGiannis, A Serotonin derivatives as a new class of non-ATP-competitive receptor tyrosine kinase inhibitors. Bioorg Med Chem 18:3387-402 (2010)  
Target
Name:
Vascular endothelial growth factor receptor 2
Synonyms:
CD_antigen=CD309 Fetal liver kinase 1 (FLK-1) KDR Protein-tyrosine kinase receptor Flk-1 VEGFR-2 VEGFR2 Vascular Endothelial Growth Factor Receptor Kinase 2 Vascular endothelial growth factor receptor 2 (KDR) Vascular endothelial growth factor receptor 2 (VEGFR2) Vascular endothelial growth factor receptor-2 (VEGFR-2)
Type:
Receptor Tyrosine Kinase
Mol. Mass.:
151510.97
Organism:
Homo sapiens (Human)
Description:
P35968
Residue:
1356
  
Inhibitor
Name:
BDBM50316784
Synonyms:
4-(2-(3-Amino-9-(3-phenylpropyl)-2,3,4,9-tetrahydro-1Htetrahydrocarbazole-6-yloxy)ethyl)phenol hydrochloride | CHEMBL1097189
Type:
Small organic molecule
Emp. Form.:
C29H32N2O2
Mol. Mass.:
440.5766
SMILES:
NC1CCc2c(C1)c1cc(OCCc3ccc(O)cc3)ccc1n2CCCc1ccccc1
: