Target
Epidermal growth factor receptor
Ligand
BDBM50316788
Substrate
Meas. Tech.
ChEMBL_632810 (CHEMBL1111024)
IC50
1000±n/a nM
Citation
 Büttner, ACottin, TXu, JTzagkaroulaki, LGiannis, A Serotonin derivatives as a new class of non-ATP-competitive receptor tyrosine kinase inhibitors. Bioorg Med Chem 18:3387-402 (2010)  
Target
Name:
Epidermal growth factor receptor
Synonyms:
EGF Receptor Substrate EGFR_HUMAN ERBB1 Epidermal Growth Factor Receptor erbB-1 Epidermal growth factor receptor (EGFR) HER1 Proto-oncogene c-ErbB-1 Tyrosine-Protein Kinase ErbB-1
Type:
Receptor Kinase Domain
Mol. Mass.:
134279.59
Organism:
Homo sapiens (Human)
Description:
P00533
Residue:
1210
  
Inhibitor
Name:
BDBM50316788
Synonyms:
4-(2-(3-amino-9-(5-phenylpentyl)-2,3,4,4a,9,9a-hexahydro-1H-carbazol-6-yloxy)ethyl)phenol hydrochloride | CHEMBL1098120
Type:
Small organic molecule
Emp. Form.:
C31H36N2O2
Mol. Mass.:
468.6297
SMILES:
NC1CCc2c(C1)c1cc(OCCc3ccc(O)cc3)ccc1n2CCCCCc1ccccc1
: