Target
5-hydroxytryptamine receptor 1A
Ligand
BDBM50316960
Substrate
Meas. Tech.
ChEMBL_630116 (CHEMBL1113707)
Ki
1.47±n/a nM
Citation
 Fiorino, FSeverino, BDe Angelis, FPerissutti, EMagli, EFrecentese, FEsposito, AMassarelli, PNencini, CSantagada, VCaliendo, G New 5-HT(1A) receptor ligands containing a N'-cyanoisonicotinamidine nucleus: synthesis and in vitro pharmacological evaluation. Bioorg Med Chem Lett 20:2978-82 (2010)  
Target
Name:
5-hydroxytryptamine receptor 1A
Synonyms:
5-HT-1A 5-HT1A 5-hydroxytryptamine receptor 1A (5HT1A) 5ht1a Htr1a Serotonin 1a (5-HT1a) receptor/Adrenergic receptor alpha-1 | Serotonin receptor 1A
Type:
G Protein-Coupled Receptor (GPCR)
Mol. Mass.:
46445.29
Organism:
Rattus norvegicus (rat)
Description:
Binding assays were performed using rat hippocampal membranes.
Residue:
422
  
Inhibitor
Name:
BDBM50316960
Synonyms:
CHEMBL1099374 | N'-cyano-N-(3-(4-(2-methoxyphenyl)piperazin-1-yl)propyl)isonicotinamidine
Type:
Small organic molecule
Emp. Form.:
C21H26N6O
Mol. Mass.:
378.4707
SMILES:
COc1ccccc1N1CCN(CCCN=C(NC#N)c2ccncc2)CC1
: