Target
Macrophage-stimulating protein receptor
Ligand
BDBM50317338
Substrate
Meas. Tech.
ChEMBL_631549 (CHEMBL1103914)
IC50
30±n/a nM
Citation
 Raeppel, SGaudette, FMannion, MClaridge, SSaavedra, OIsakovic, LDéziel, RBeaulieu, NBeaulieu, CDupont, INguyen, HWang, JMacleod, ARMaroun, CBesterman, JMVaisburg, A Identification of a novel series of potent RON receptor tyrosine kinase inhibitors. Bioorg Med Chem Lett 20:2745-9 (2010)  
Target
Name:
Macrophage-stimulating protein receptor
Synonyms:
2.7.10.1 CDw136 MST1R Macrophage-stimulating protein receptor alpha chain PTK8 RON Tyrosine kinase receptor ron | p185-Ron
Type:
Protein
Mol. Mass.:
152270.76
Organism:
Homo sapiens (Human)
Description:
Q04912
Residue:
1400
  
Inhibitor
Name:
BDBM50317338
Synonyms:
6-(7-(2-fluoro-4-(1-phenyl-5-(trifluoromethyl)-1H-pyrazole-4-carboxamido)phenoxy)thieno[3,2-b]pyridin-2-yl)-N,N-dimethylnicotinamide | CHEMBL1095359
Type:
Small organic molecule
Emp. Form.:
C32H22F4N6O3S
Mol. Mass.:
646.614
SMILES:
CN(C)C(=O)c1ccc(nc1)-c1cc2nccc(Oc3ccc(NC(=O)c4cnn(c4C(F)(F)F)-c4ccccc4)cc3F)c2s1
: