Target
Cyclin-A1/Cyclin-A2/Cyclin-dependent kinase 2
Ligand
BDBM50318068
Substrate
Meas. Tech.
ChEMBL_631393 (CHEMBL1109145)
IC50
1121±n/a nM
Citation
 Beria, IBallinari, DBertrand, JABorghi, DBossi, RTBrasca, MGCappella, PCaruso, MCeccarelli, WCiavolella, ACristiani, CCroci, VDe Ponti, AFachin, GFerguson, RDLansen, JMoll, JKPesenti, EPosteri, HPerego, RRocchetti, MStorici, PVolpi, DValsasina, B Identification of 4,5-dihydro-1H-pyrazolo[4,3-h]quinazoline derivatives as a new class of orally and selective Polo-like kinase 1 inhibitors. J Med Chem 53:3532-51 (2010)  
Target
Name:
Cyclin-A1/Cyclin-A2/Cyclin-dependent kinase 2
Synonyms:
CDK2/Cyclin A/Cyclin A1 Cyclin-dependent kinase 2/cyclin A
Type:
Mol. Mass.:
Description:
ASSAY_ID of EBI is 42813
Components:
This complex has 3 components.
Component 1
Name:
Cyclin-A2
Synonyms:
CCN1 CCNA1 CCNA2_HUMAN Cyclin-A
Type:
Enzyme Subunit
Mol. Mass.:
48550.19
Organism:
Homo sapiens (Human)
Description:
P20248
Residue:
432
  
Component 2
Name:
Cyclin-A1
Synonyms:
CCNA1 CDK2/Cyclin A1 Cyclin-A1/Cyclin-dependent kinase 4
Type:
Enzyme
Mol. Mass.:
52343.37
Organism:
Homo sapiens (Human)
Description:
P78396
Residue:
465
  
Component 3
Name:
Cyclin-dependent kinase 2
Synonyms:
CDK2 CDK2_HUMAN Cell division protein kinase 2 Protein cereblon/Cyclin-dependent kinase 2 | p33 protein kinase
Type:
Enzyme Subunit
Mol. Mass.:
33938.17
Organism:
Homo sapiens (Human)
Description:
P24941
Residue:
298
  
Component 4
Name:
Cyclin-A2
Synonyms:
CCN1 CCNA1 CCNA2_HUMAN Cyclin-A
Type:
Enzyme Subunit
Mol. Mass.:
48550.19
Organism:
Homo sapiens (Human)
Description:
P20248
Residue:
432
  
Inhibitor
Name:
BDBM50318068
Synonyms:
8-{[2-Acetyl-3-(4-methylpiperazin-1-yl)phenyl]amino}-1-methyl-4,5-dihydro-1H-pyrazolo[4,3-h]quinazoline-3-carboxamide | CHEMBL1097374
Type:
Small organic molecule
Emp. Form.:
C24H28N8O2
Mol. Mass.:
460.5315
SMILES:
CN1CCN(CC1)c1cccc(Nc2ncc3CCc4c(nn(C)c4-c3n2)C(N)=O)c1C(C)=O
: