Target
Serine/threonine-protein kinase PLK1
Ligand
BDBM31533
Substrate
Meas. Tech.
ChEMBL_631389 (CHEMBL1109141)
IC50
4215±n/a nM
Citation
 Beria, IBallinari, DBertrand, JABorghi, DBossi, RTBrasca, MGCappella, PCaruso, MCeccarelli, WCiavolella, ACristiani, CCroci, VDe Ponti, AFachin, GFerguson, RDLansen, JMoll, JKPesenti, EPosteri, HPerego, RRocchetti, MStorici, PVolpi, DValsasina, B Identification of 4,5-dihydro-1H-pyrazolo[4,3-h]quinazoline derivatives as a new class of orally and selective Polo-like kinase 1 inhibitors. J Med Chem 53:3532-51 (2010)  
Target
Name:
Serine/threonine-protein kinase PLK1
Synonyms:
PLK PLK1 Polo-like kinase 1 (PlK1) STPK13 Serine/threonine-protein kinase 13 | polo-like kinase
Type:
Serine/threonine-protein kinase
Mol. Mass.:
68277.16
Organism:
Homo sapiens (Human)
Description:
P53350
Residue:
603
  
Inhibitor
Name:
BDBM31533
Synonyms:
pyrazolo[4,3-h]quinazoline-3-carboxamide, 16
Type:
Small organic molecule
Emp. Form.:
C18H18N6O
Mol. Mass.:
334.3751
SMILES:
CNC(=O)c1nn(C)c-2c1CCc1cnc(Nc3ccccc3)nc-21
: