Target
Aurora kinase A
Ligand
BDBM50318088
Substrate
Meas. Tech.
ChEMBL_631394 (CHEMBL1109146)
IC50
176±n/a nM
Citation
 Beria, IBallinari, DBertrand, JABorghi, DBossi, RTBrasca, MGCappella, PCaruso, MCeccarelli, WCiavolella, ACristiani, CCroci, VDe Ponti, AFachin, GFerguson, RDLansen, JMoll, JKPesenti, EPosteri, HPerego, RRocchetti, MStorici, PVolpi, DValsasina, B Identification of 4,5-dihydro-1H-pyrazolo[4,3-h]quinazoline derivatives as a new class of orally and selective Polo-like kinase 1 inhibitors. J Med Chem 53:3532-51 (2010)  
Target
Name:
Aurora kinase A
Synonyms:
AIK ARK-1 AURA AURKA_HUMAN Aurora 2 Aurora kinase A (AURKA) Aurora kinase A (Aurora-2) Aurora/IPL1-related kinase 1 Breast tumor-amplified kinase IAK1 STK15 GN Serine/threonine kinase 15 Serine/threonine-protein kinase 6 Serine/threonine-protein kinase aurora-A aurora-2 | hARK1
Type:
Serine/threonine-protein kinase
Mol. Mass.:
45830.98
Organism:
Homo sapiens (Human)
Description:
O14965
Residue:
403
  
Inhibitor
Name:
BDBM50318088
Synonyms:
8-[(3-Acetylphenyl)amino]-1-methyl-4,5-dihydro-1H-pyrazolo-[4,3-h]quinazoline-3-carboxamide | CHEMBL1099105
Type:
Small organic molecule
Emp. Form.:
C19H18N6O2
Mol. Mass.:
362.3852
SMILES:
CC(=O)c1cccc(Nc2ncc3CCc4c(nn(C)c4-c3n2)C(N)=O)c1
: