Target
Serine/threonine-protein kinase PLK2
Ligand
BDBM31532
Substrate
Meas. Tech.
ChEMBL_631390 (CHEMBL1109142)
IC50
9±n/a nM
Citation
 Beria, IBallinari, DBertrand, JABorghi, DBossi, RTBrasca, MGCappella, PCaruso, MCeccarelli, WCiavolella, ACristiani, CCroci, VDe Ponti, AFachin, GFerguson, RDLansen, JMoll, JKPesenti, EPosteri, HPerego, RRocchetti, MStorici, PVolpi, DValsasina, B Identification of 4,5-dihydro-1H-pyrazolo[4,3-h]quinazoline derivatives as a new class of orally and selective Polo-like kinase 1 inhibitors. J Med Chem 53:3532-51 (2010)  
Target
Name:
Serine/threonine-protein kinase PLK2
Synonyms:
PLK2 Polo-Like Kinase 2 Serine/threonine-protein kinase PLK2 Serum-inducible kinase
Type:
Serine/threonine-protein kinase
Mol. Mass.:
78259.87
Organism:
Homo sapiens (Human)
Description:
Full-length human PLK2 was expressed as GST-fusion protein using baculovirus expression system. GST-PLK2 was purified by using glutathione sepharose chromatography.
Residue:
685
  
Inhibitor
Name:
BDBM31532
Synonyms:
pyrazolo[4,3-h]quinazoline-3-carboxamide, 1
Type:
Small organic molecule
Emp. Form.:
C17H16N6O
Mol. Mass.:
320.3485
SMILES:
Cn1nc(C(N)=O)c2CCc3cnc(Nc4ccccc4)nc3-c12
: