Target
Acetylcholinesterase
Ligand
BDBM50005764
Substrate
Meas. Tech.
ChEMBL_633769 (CHEMBL1119333)
IC50
1076±n/a nM
Citation
 Lv, WXue, Y Prediction of acetylcholinesterase inhibitors and characterization of correlative molecular descriptors by machine learning methods. Eur J Med Chem 45:1167-72 (2010)  
Target
Name:
Acetylcholinesterase
Synonyms:
ACES_HUMAN Acetylcholinesterase (AChE) | Acetylcholinesterase (human AChE)
Type:
Enzyme
Mol. Mass.:
67792.70
Organism:
Homo sapiens (Human)
Description:
P22303
Residue:
614
  
Inhibitor
Name:
BDBM50005764
Synonyms:
(+/-)-Butyl-carbamic acid 1-ethyl-1,2,3,3a,8,8a-hexahydro-1-aza-cyclopenta[a]inden-5-yl ester | CHEMBL33727
Type:
Small organic molecule
Emp. Form.:
C18H26N2O2
Mol. Mass.:
302.4112
SMILES:
CCCCNC(=O)Oc1ccc2CC3[C@@H](CCN3CC)c2c1
: