Target
Acetylcholinesterase
Ligand
BDBM50037157
Substrate
Meas. Tech.
ChEMBL_633769 (CHEMBL1119333)
IC50
100±n/a nM
Citation
 Lv, WXue, Y Prediction of acetylcholinesterase inhibitors and characterization of correlative molecular descriptors by machine learning methods. Eur J Med Chem 45:1167-72 (2010)  
Target
Name:
Acetylcholinesterase
Synonyms:
ACES_HUMAN Acetylcholinesterase (AChE) | Acetylcholinesterase (human AChE)
Type:
Enzyme
Mol. Mass.:
67792.70
Organism:
Homo sapiens (Human)
Description:
P22303
Residue:
614
  
Inhibitor
Name:
BDBM50037157
Synonyms:
3-(1-Benzyl-piperidin-4-yl)-1-(2,3,4,5-tetrahydro-1H-benzo[b]azepin-8-yl)-propan-1-one CHEMBL75013 Zanapezil
Type:
Small organic molecule
Emp. Form.:
C25H32N2O
Mol. Mass.:
376.5344
SMILES:
O=C(CCC1CCN(Cc2ccccc2)CC1)c1ccc2CCCCNc2c1
: