Target
Beta-2 adrenergic receptor
Ligand
BDBM50318974
Substrate
Meas. Tech.
ChEMBL_635468 (CHEMBL1120618)
Ki
50±n/a nM
Citation
 Tasler, SBaumgartner, RAschenbrenner, AAmmendola, AWolf, KWieber, TSchachtner, JBlisse, MQuotschalla, UNey, P A vHTS approach for the identification of beta-adrenoceptor ligands. Bioorg Med Chem Lett 20:3399-404 (2010)  
Target
Name:
Beta-2 adrenergic receptor
Synonyms:
ADRB2 ADRB2_HUMAN Beta-2 adrenoceptor | Beta-2 adrenoreceptor
Type:
Mol. Mass.:
46461.69
Organism:
Homo sapiens (Human)
Description:
P07550
Residue:
413
  
Inhibitor
Name:
BDBM50318974
Synonyms:
2-((1-(3-(2-allylphenoxy)-2-hydroxypropyl)piperidin-4-yl)methyl)isoindoline-1,3-dione | CHEMBL1085016
Type:
Small organic molecule
Emp. Form.:
C26H30N2O4
Mol. Mass.:
434.5274
SMILES:
OC(COc1ccccc1CC=C)CN1CCC(CN2C(=O)c3ccccc3C2=O)CC1
: