Target
Beta-2 adrenergic receptor
Ligand
BDBM50318976
Substrate
Meas. Tech.
ChEMBL_635468 (CHEMBL1120618)
Ki
80±n/a nM
Citation
 Tasler, SBaumgartner, RAschenbrenner, AAmmendola, AWolf, KWieber, TSchachtner, JBlisse, MQuotschalla, UNey, P A vHTS approach for the identification of beta-adrenoceptor ligands. Bioorg Med Chem Lett 20:3399-404 (2010)  
Target
Name:
Beta-2 adrenergic receptor
Synonyms:
ADRB2 ADRB2_HUMAN Beta-2 adrenoceptor | Beta-2 adrenoreceptor
Type:
Mol. Mass.:
46461.69
Organism:
Homo sapiens (Human)
Description:
P07550
Residue:
413
  
Inhibitor
Name:
BDBM50318976
Synonyms:
1-((1-(3-(2-allylphenoxy)-2-hydroxypropyl)piperidin-4-yl)methyl)piperidine-2,6-dione | CHEMBL1085009
Type:
Small organic molecule
Emp. Form.:
C23H32N2O4
Mol. Mass.:
400.5112
SMILES:
OC(COc1ccccc1CC=C)CN1CCC(CN2C(=O)CCCC2=O)CC1
: