Target
Beta-2 adrenergic receptor
Ligand
BDBM50318991
Substrate
Meas. Tech.
ChEMBL_635468 (CHEMBL1120618)
Ki
80±n/a nM
Citation
 Tasler, SBaumgartner, RAschenbrenner, AAmmendola, AWolf, KWieber, TSchachtner, JBlisse, MQuotschalla, UNey, P A vHTS approach for the identification of beta-adrenoceptor ligands. Bioorg Med Chem Lett 20:3399-404 (2010)  
Target
Name:
Beta-2 adrenergic receptor
Synonyms:
ADRB2 ADRB2_HUMAN Beta-2 adrenoceptor | Beta-2 adrenoreceptor
Type:
Mol. Mass.:
46461.69
Organism:
Homo sapiens (Human)
Description:
P07550
Residue:
413
  
Inhibitor
Name:
BDBM50318991
Synonyms:
2-((1-(2-hydroxy-3-(2-isopropyl-5-methylphenoxy)propyl)piperidin-4-yl)methyl)-1H-benzo[de]isoquinoline-1,3(2H)-dione | CHEMBL1083994
Type:
Small organic molecule
Emp. Form.:
C31H36N2O4
Mol. Mass.:
500.6285
SMILES:
CC(C)c1ccc(C)cc1OCC(O)CN1CCC(CN2C(=O)c3cccc4cccc(C2=O)c34)CC1
: