Target
Beta-1 adrenergic receptor
Ligand
BDBM50318990
Substrate
Meas. Tech.
ChEMBL_635467 (CHEMBL1120617)
Ki
32±n/a nM
Citation
 Tasler, SBaumgartner, RAschenbrenner, AAmmendola, AWolf, KWieber, TSchachtner, JBlisse, MQuotschalla, UNey, P A vHTS approach for the identification of beta-adrenoceptor ligands. Bioorg Med Chem Lett 20:3399-404 (2010)  
Target
Name:
Beta-1 adrenergic receptor
Synonyms:
ADRB1 ADRB1_HUMAN Beta-1 adrenoceptor adrenergic Beta1
Type:
G Protein-Coupled Receptor (GPCR)
Mol. Mass.:
51338.40
Organism:
Homo sapiens (Human)
Description:
P08588
Residue:
477
  
Inhibitor
Name:
BDBM50318990
Synonyms:
(1-(3-(9H-carbazol-4-yloxy)-2-hydroxypropyl)piperidin-4-yl)(4-fluorophenyl)methanone | CHEMBL1086077
Type:
Small organic molecule
Emp. Form.:
C27H27FN2O3
Mol. Mass.:
446.5133
SMILES:
OC(COc1cccc2[nH]c3ccccc3c12)CN1CCC(CC1)C(=O)c1ccc(F)cc1
: