Target
Beta-2 adrenergic receptor
Ligand
BDBM78700
Substrate
Meas. Tech.
ChEMBL_635468 (CHEMBL1120618)
Ki
150±n/a nM
Citation
 Tasler, SBaumgartner, RAschenbrenner, AAmmendola, AWolf, KWieber, TSchachtner, JBlisse, MQuotschalla, UNey, P A vHTS approach for the identification of beta-adrenoceptor ligands. Bioorg Med Chem Lett 20:3399-404 (2010)  
Target
Name:
Beta-2 adrenergic receptor
Synonyms:
ADRB2 ADRB2_HUMAN Beta-2 adrenoceptor | Beta-2 adrenoreceptor
Type:
Mol. Mass.:
46461.69
Organism:
Homo sapiens (Human)
Description:
P07550
Residue:
413
  
Inhibitor
Name:
BDBM78700
Synonyms:
2-(2-{4-[3-(2-allylphenoxy)-2-hydroxypropyl]-1-piperazinyl}ethyl)-1H-benzo[de]isoquinoline-1,3(2H)-dione dihydrochloride 2-[2-[4-[2-hydroxy-3-(2-prop-2-enylphenoxy)propyl]piperazin-1-yl]ethyl]benzo[de]isoquinoline-1,3-dione;hydrochloride 2-[2-[4-[3-(2-allylphenoxy)-2-hydroxy-propyl]piperazino]ethyl]benzo[de]isoquinoline-1,3-quinone;hydrochloride MLS000680564 cid_15945836
Type:
Small organic molecule
Emp. Form.:
C30H33N3O4
Mol. Mass.:
499.6007
SMILES:
OC(COc1ccccc1CC=C)CN1CCN(CCN2C(=O)c3cccc4cccc(C2=O)c34)CC1
: