Target
Beta-1 adrenergic receptor
Ligand
BDBM50318971
Substrate
Meas. Tech.
ChEMBL_635472 (CHEMBL1120622)
Ki
170±n/a nM
Citation
 Tasler, SBaumgartner, RAschenbrenner, AAmmendola, AWolf, KWieber, TSchachtner, JBlisse, MQuotschalla, UNey, P A vHTS approach for the identification of beta-adrenoceptor ligands. Bioorg Med Chem Lett 20:3399-404 (2010)  
Target
Name:
Beta-1 adrenergic receptor
Synonyms:
ADRB1 ADRB1_HUMAN Beta-1 adrenoceptor adrenergic Beta1
Type:
G Protein-Coupled Receptor (GPCR)
Mol. Mass.:
51338.40
Organism:
Homo sapiens (Human)
Description:
P08588
Residue:
477
  
Inhibitor
Name:
BDBM50318971
Synonyms:
2-((1-(3-(2-allylphenoxy)-2-hydroxypropyl)piperidin-4-yl)methyl)-5-hydroxy-1H-benzo[de]isoquinoline-1,3(2H)-dione | CHEMBL1085014
Type:
Small organic molecule
Emp. Form.:
C30H32N2O5
Mol. Mass.:
500.5855
SMILES:
OC(COc1ccccc1CC=C)CN1CCC(CN2C(=O)c3cccc4cc(O)cc(C2=O)c34)CC1
: