Target
Beta-1 adrenergic receptor
Ligand
BDBM50318974
Substrate
Meas. Tech.
ChEMBL_635472 (CHEMBL1120622)
Ki
190±n/a nM
Citation
 Tasler, SBaumgartner, RAschenbrenner, AAmmendola, AWolf, KWieber, TSchachtner, JBlisse, MQuotschalla, UNey, P A vHTS approach for the identification of beta-adrenoceptor ligands. Bioorg Med Chem Lett 20:3399-404 (2010)  
Target
Name:
Beta-1 adrenergic receptor
Synonyms:
ADRB1 ADRB1_HUMAN Beta-1 adrenoceptor adrenergic Beta1
Type:
G Protein-Coupled Receptor (GPCR)
Mol. Mass.:
51338.40
Organism:
Homo sapiens (Human)
Description:
P08588
Residue:
477
  
Inhibitor
Name:
BDBM50318974
Synonyms:
2-((1-(3-(2-allylphenoxy)-2-hydroxypropyl)piperidin-4-yl)methyl)isoindoline-1,3-dione | CHEMBL1085016
Type:
Small organic molecule
Emp. Form.:
C26H30N2O4
Mol. Mass.:
434.5274
SMILES:
OC(COc1ccccc1CC=C)CN1CCC(CN2C(=O)c3ccccc3C2=O)CC1
: