Target
Beta-1 adrenergic receptor
Ligand
BDBM50318980
Substrate
Meas. Tech.
ChEMBL_635472 (CHEMBL1120622)
Ki
260±n/a nM
Citation
 Tasler, SBaumgartner, RAschenbrenner, AAmmendola, AWolf, KWieber, TSchachtner, JBlisse, MQuotschalla, UNey, P A vHTS approach for the identification of beta-adrenoceptor ligands. Bioorg Med Chem Lett 20:3399-404 (2010)  
Target
Name:
Beta-1 adrenergic receptor
Synonyms:
ADRB1 ADRB1_HUMAN Beta-1 adrenoceptor adrenergic Beta1
Type:
G Protein-Coupled Receptor (GPCR)
Mol. Mass.:
51338.40
Organism:
Homo sapiens (Human)
Description:
P08588
Residue:
477
  
Inhibitor
Name:
BDBM50318980
Synonyms:
1-(2-allylphenoxy)-3-(1-methylpiperidin-4-ylamino)propan-2-ol | CHEMBL1083669
Type:
Small organic molecule
Emp. Form.:
C18H28N2O2
Mol. Mass.:
304.4271
SMILES:
CN1CCC(CC1)NCC(O)COc1ccccc1CC=C
: