Target
Beta-1 adrenergic receptor
Ligand
BDBM50318981
Substrate
Meas. Tech.
ChEMBL_635472 (CHEMBL1120622)
Ki
89±n/a nM
Citation
 Tasler, SBaumgartner, RAschenbrenner, AAmmendola, AWolf, KWieber, TSchachtner, JBlisse, MQuotschalla, UNey, P A vHTS approach for the identification of beta-adrenoceptor ligands. Bioorg Med Chem Lett 20:3399-404 (2010)  
Target
Name:
Beta-1 adrenergic receptor
Synonyms:
ADRB1 ADRB1_HUMAN Beta-1 adrenoceptor adrenergic Beta1
Type:
G Protein-Coupled Receptor (GPCR)
Mol. Mass.:
51338.40
Organism:
Homo sapiens (Human)
Description:
P08588
Residue:
477
  
Inhibitor
Name:
BDBM50318981
Synonyms:
1-(2-isopropylphenoxy)-3-(1-methylpiperidin-4-ylamino)propan-2-ol | CHEMBL1083670
Type:
Small organic molecule
Emp. Form.:
C18H30N2O2
Mol. Mass.:
306.443
SMILES:
CC(C)c1ccccc1OCC(O)CNC1CCN(C)CC1
: