Target
Beta-1 adrenergic receptor
Ligand
BDBM50318984
Substrate
Meas. Tech.
ChEMBL_635472 (CHEMBL1120622)
Ki
76±n/a nM
Citation
 Tasler, SBaumgartner, RAschenbrenner, AAmmendola, AWolf, KWieber, TSchachtner, JBlisse, MQuotschalla, UNey, P A vHTS approach for the identification of beta-adrenoceptor ligands. Bioorg Med Chem Lett 20:3399-404 (2010)  
Target
Name:
Beta-1 adrenergic receptor
Synonyms:
ADRB1 ADRB1_HUMAN Beta-1 adrenoceptor adrenergic Beta1
Type:
G Protein-Coupled Receptor (GPCR)
Mol. Mass.:
51338.40
Organism:
Homo sapiens (Human)
Description:
P08588
Residue:
477
  
Inhibitor
Name:
BDBM50318984
Synonyms:
2-(1-(3-(9H-carbazol-4-yloxy)-2-hydroxypropyl)piperidin-4-yl)-1H-benzo[de]isoquinoline-1,3(2H)-dione | CHEMBL1083363
Type:
Small organic molecule
Emp. Form.:
C32H29N3O4
Mol. Mass.:
519.5904
SMILES:
OC(COc1cccc2[nH]c3ccccc3c12)CN1CCC(CC1)N1C(=O)c2cccc3cccc(C1=O)c23
: