Target
Beta-3 adrenergic receptor
Ligand
BDBM50318984
Substrate
Meas. Tech.
ChEMBL_635476 (CHEMBL1117710)
Ki
98±n/a nM
Citation
 Tasler, SBaumgartner, RAschenbrenner, AAmmendola, AWolf, KWieber, TSchachtner, JBlisse, MQuotschalla, UNey, P A vHTS approach for the identification of beta-adrenoceptor ligands. Bioorg Med Chem Lett 20:3399-404 (2010)  
Target
Name:
Beta-3 adrenergic receptor
Synonyms:
ADRB3 ADRB3_HUMAN Beta-2 adrenergic receptor and beta-3 adrenergic receptor Beta-3 adrenoreceptor | adrenergic Beta3
Type:
G Protein-Coupled Receptor (GPCR)
Mol. Mass.:
43534.88
Organism:
Homo sapiens (Human)
Description:
Residue:
408
  
Inhibitor
Name:
BDBM50318984
Synonyms:
2-(1-(3-(9H-carbazol-4-yloxy)-2-hydroxypropyl)piperidin-4-yl)-1H-benzo[de]isoquinoline-1,3(2H)-dione | CHEMBL1083363
Type:
Small organic molecule
Emp. Form.:
C32H29N3O4
Mol. Mass.:
519.5904
SMILES:
OC(COc1cccc2[nH]c3ccccc3c12)CN1CCC(CC1)N1C(=O)c2cccc3cccc(C1=O)c23
: