Target
Beta-3 adrenergic receptor
Ligand
BDBM50318987
Substrate
Meas. Tech.
ChEMBL_635476 (CHEMBL1117710)
Ki
72±n/a nM
Citation
 Tasler, SBaumgartner, RAschenbrenner, AAmmendola, AWolf, KWieber, TSchachtner, JBlisse, MQuotschalla, UNey, P A vHTS approach for the identification of beta-adrenoceptor ligands. Bioorg Med Chem Lett 20:3399-404 (2010)  
Target
Name:
Beta-3 adrenergic receptor
Synonyms:
ADRB3 ADRB3_HUMAN Beta-2 adrenergic receptor and beta-3 adrenergic receptor Beta-3 adrenoreceptor | adrenergic Beta3
Type:
G Protein-Coupled Receptor (GPCR)
Mol. Mass.:
43534.88
Organism:
Homo sapiens (Human)
Description:
Residue:
408
  
Inhibitor
Name:
BDBM50318987
Synonyms:
1-(9H-carbazol-4-yloxy)-3-(4-(pyridin-3-ylmethyl)piperidin-1-yl)propan-2-ol | CHEMBL1082501
Type:
Small organic molecule
Emp. Form.:
C26H29N3O2
Mol. Mass.:
415.5274
SMILES:
OC(COc1cccc2[nH]c3ccccc3c12)CN1CCC(Cc2cccnc2)CC1
: