Target
Beta-1 adrenergic receptor
Ligand
BDBM50318998
Substrate
Meas. Tech.
ChEMBL_635472 (CHEMBL1120622)
Ki
27±n/a nM
Citation
 Tasler, SBaumgartner, RAschenbrenner, AAmmendola, AWolf, KWieber, TSchachtner, JBlisse, MQuotschalla, UNey, P A vHTS approach for the identification of beta-adrenoceptor ligands. Bioorg Med Chem Lett 20:3399-404 (2010)  
Target
Name:
Beta-1 adrenergic receptor
Synonyms:
ADRB1 ADRB1_HUMAN Beta-1 adrenoceptor adrenergic Beta1
Type:
G Protein-Coupled Receptor (GPCR)
Mol. Mass.:
51338.40
Organism:
Homo sapiens (Human)
Description:
P08588
Residue:
477
  
Inhibitor
Name:
BDBM50318998
Synonyms:
2-((1-(3-(1H-indol-4-yloxy)-2-hydroxypropyl)piperidin-4-yl)methyl)-1H-benzo[de]isoquinoline-1,3(2H)-dione | CHEMBL1083368
Type:
Small organic molecule
Emp. Form.:
C29H29N3O4
Mol. Mass.:
483.5583
SMILES:
OC(COc1cccc2[nH]ccc12)CN1CCC(CN2C(=O)c3cccc4cccc(C2=O)c34)CC1
: