Target
Histamine H4 receptor
Ligand
BDBM50319296
Substrate
Meas. Tech.
ChEMBL_634016 (CHEMBL1117989)
Ki
>10000±n/a nM
Citation
 Savall, BMEdwards, JPVenable, JDBuzard, DJThurmond, RHack, MMcGovern, P Agonist/antagonist modulation in a series of 2-aryl benzimidazole H4 receptor ligands. Bioorg Med Chem Lett 20:3367-71 (2010)  
Target
Name:
Histamine H4 receptor
Synonyms:
AXOR35 GPCR105 HH4R HRH4 Histamine H4 receptor Histamine receptor (H3 and H4) SP9144
Type:
G Protein-Coupled Receptor (GPCR)
Mol. Mass.:
44517.02
Organism:
Homo sapiens (Human)
Description:
Binding assays were using CHO cells stably expressing hH4R receptors.
Residue:
390
  
Inhibitor
Name:
BDBM50319296
Synonyms:
3-(4-(5-fluoro-4-methyl-1H-benzo[d]imidazol-2-yl)-3-methylphenoxy)-N-(pyridin-2-ylmethyl)propan-1-amine | CHEMBL1083159
Type:
Small organic molecule
Emp. Form.:
C24H25FN4O
Mol. Mass.:
404.4799
SMILES:
Cc1cc(OCCCNCc2ccccn2)ccc1-c1nc2ccc(F)c(C)c2[nH]1
: