Target
Cholinesterase
Ligand
BDBM50319384
Substrate
Meas. Tech.
ChEMBL_634041 (CHEMBL1118313)
IC50
78±n/a nM
Citation
 Yu, LCao, RYi, WYan, QChen, ZMa, LPeng, WSong, H Synthesis of 4-[(diethylamino)methyl]-phenol derivatives as novel cholinesterase inhibitors with selectivity towards butyrylcholinesterase. Bioorg Med Chem Lett 20:3254-8 (2010)  
Target
Name:
Cholinesterase
Synonyms:
BCHE CHLE_HORSE | Cholinesterase
Type:
Enzyme
Mol. Mass.:
65643.35
Organism:
Equus caballus (Horse)
Description:
P81908
Residue:
574
  
Inhibitor
Name:
BDBM50319384
Synonyms:
CHEMBL1085869 | N-ethyl-N-(4-(10-(piperidin-1-yl)decyloxy)benzyl)ethanamine
Type:
Small organic molecule
Emp. Form.:
C26H46N2O
Mol. Mass.:
402.6562
SMILES:
CCN(CC)Cc1ccc(OCCCCCCCCCCN2CCCCC2)cc1
: