Target
C-C chemokine receptor type 5
Ligand
BDBM50319443
Substrate
Meas. Tech.
ChEMBL_634191 (CHEMBL1119773)
IC50
24±n/a nM
Citation
 Rotstein, DMGabriel, SDManser, NFilonova, LPadilla, FSankuratri, SJi, CdeRosier, ADioszegi, MHeilek, GJekle, AWeller, PBerry, P Synthesis, SAR and evaluation of [1,4']-bipiperidinyl-4-yl-imidazolidin-2-one derivatives as novel CCR5 antagonists. Bioorg Med Chem Lett 20:3219-22 (2010)  
Target
Name:
C-C chemokine receptor type 5
Synonyms:
C-C CKR-5 CC-CKR-5 CCR5 CCR5_HUMAN CHEMR13 HIV-1 fusion coreceptor
Type:
Enzyme
Mol. Mass.:
40540.21
Organism:
Homo sapiens (Human)
Description:
P51681
Residue:
352
  
Inhibitor
Name:
BDBM50319443
Synonyms:
(R)-4,6-dimethyl-5-(4'-methyl-4-(3-methyl-2-oxo-5-phenylimidazolidin-1-yl)-1,4'-bipiperidine-1'-carbonyl)picolinonitrile | CHEMBL1083126
Type:
Small organic molecule
Emp. Form.:
C30H38N6O2
Mol. Mass.:
514.6617
SMILES:
CN1C[C@H](N(C2CCN(CC2)C2(C)CCN(CC2)C(=O)c2c(C)cc(nc2C)C#N)C1=O)c1ccccc1
: