Target
Cathepsin S
Ligand
BDBM50320055
Substrate
Meas. Tech.
ChEMBL_635108 (CHEMBL1119418)
IC50
23.8±n/a nM
Citation
 Chen, JCUang, BJLyu, PCChang, JYLiu, KJKuo, CCHsieh, HPWang, HCCheng, CSChang, YHChang, MDChang, WSLin, CC Design and synthesis of alpha-ketoamides as cathepsin S inhibitors with potential applications against tumor invasion and angiogenesis. J Med Chem 53:4545-9 (2010)  
Target
Name:
Cathepsin S
Synonyms:
CATS_HUMAN Cathepsin S (Cat S) | cathepsin S preproprotein
Type:
Protein
Mol. Mass.:
37507.38
Organism:
Homo sapiens (Human)
Description:
P25774
Residue:
331
  
Inhibitor
Name:
BDBM50320055
Synonyms:
CHEMBL1085978 | ethyl 2-(4-(benzyloxy)-3-((S)-2-(5-bromo-2-(tert-butoxycarbonylamino)benzamido)-3-cyclohexylpropanamido)-2-oxobutanamido)acetate
Type:
Small organic molecule
Emp. Form.:
C36H47BrN4O9
Mol. Mass.:
759.684
SMILES:
CCOC(=O)CNC(=O)C(=O)C(COCc1ccccc1)NC(=O)[C@H](CC1CCCCC1)NC(=O)c1cc(Br)ccc1NC(=O)OC(C)(C)C
: