Target
Sodium-dependent serotonin transporter
Ligand
BDBM50320446
Substrate
Meas. Tech.
ChEMBL_634136 (CHEMBL1119143)
Ki
16±n/a nM
Citation
 Prabhakaran, JMajo, VJMilak, MSMali, PSavenkova, LMann, JJParsey, RVKumar, JS Synthesis and in vivo evaluation of [11C]MPTQ: a potential PET tracer for alpha2A-adrenergic receptors. Bioorg Med Chem Lett 20:3654-7 (2010)  
Target
Name:
Sodium-dependent serotonin transporter
Synonyms:
5-HT Transporter 5HTT SC6A4_HUMAN SLC6A4 Serotonin transporter (5HTT) Sodium-dependent serotonin transporter (SERT) | Solute carrier family 6 member 4
Type:
Multi-pass membrane protein
Mol. Mass.:
70322.51
Organism:
Homo sapiens (Human)
Description:
P31645
Residue:
630
  
Inhibitor
Name:
BDBM50320446
Synonyms:
CHEMBL1085510 | [N-methyl]5-methyl-3-[4-(3-phenylallyl)-piperazin-1-ylmethyl]-3,3a,4,5-tetrahydroisoxazolo[4,3-c]quinoline
Type:
Small organic molecule
Emp. Form.:
C25H30N4O
Mol. Mass.:
402.5319
SMILES:
CN1CC2[C@H](CN3CCN(C\C=C\c4ccccc4)CC3)ON=C2c2ccccc12
: