Target
Neuronal acetylcholine receptor subunit alpha-7
Ligand
BDBM50320567
Substrate
Meas. Tech.
ChEMBL_638469 (CHEMBL1168510)
Ki
699±n/a nM
Citation
 Slavov, SHRadzvilovits, MLeFrancois, SStoyanova-Slavova, IBSoti, FKem, WRKatritzky, AR A computational study of the binding of 3-(arylidene) anabaseines to two major brain nicotinic acetylcholine receptors and to the acetylcholine binding protein. Eur J Med Chem 45:2433-46 (2010)  
Target
Name:
Neuronal acetylcholine receptor subunit alpha-7
Synonyms:
ACHA7_RAT Cholinergic, Nicotinic Alpha7 Chrna7 Neuronal acetylcholine receptor (alpha7 nAChR) Neuronal acetylcholine receptor subunit alpha-7 Neuronal acetylcholine receptor subunit alpha-7 (nAChR)
Type:
Enzyme
Mol. Mass.:
56502.44
Organism:
Rattus norvegicus (Rat)
Description:
Q05941
Residue:
502
  
Inhibitor
Name:
BDBM50320567
Synonyms:
3-(2,4-Dihydroxybenzylidene)anabaseine | CHEMBL1165604
Type:
Small organic molecule
Emp. Form.:
C17H16N2O2
Mol. Mass.:
280.3211
SMILES:
Oc1ccc(\C=C2/CCCN=C2c2cccnc2)c(O)c1
: